BDBM33973 arylalkyne pyrazole-based compound, 4
SMILES CS(=O)(=O)N1CCc2c(C1)c(nn2CCCN1CCOCC1)-c1ccc(Cl)c(c1)C#CCO
InChI Key InChIKey=SCYXWTGXOHPASF-UHFFFAOYSA-N
Data  1 IC50
  Tab Delimited (TSV)   2D SDfile   Computed 3D by Vconf -m prep SDfile
Find this compound or compounds like it in BindingDB:
Activity Spreadsheet -- Enzyme Inhibition Constant Data from BindingDB
Found 1 hit for monomerid = 33973
TargetCathepsin S(Homo sapiens (Human))
Johnson & Johnson Pharmaceutical
LigandPNGBDBM33973(arylalkyne pyrazole-based compound, 4)
Affinity DataIC50:  7.90E+3nMpH: 5.0 T: 2°C. Assay description: Enzyme assays were run using fluorescence resonance energy transfer-based substrates, (Aedens)EKARVLAEAA(Dabcyl)K-amide and cathepsin S cleaves betwe...
In DepthDetails ArticlePubMed